• Hi, Pleskians! We are running a UX testing of our upcoming product intended for server management and monitoring.
    We would like to invite you to have a call with us and have some fun checking our prototype. The agenda is pretty simple - we bring new design and some scenarios that you need to walk through and succeed. We will be watching and taking insights for further development of the design.
    If you would like to participate, please use this link to book a meeting. We will sent the link to the clickable prototype at the meeting.
  • Our UX team believes in the in the power of direct feedback and would like to invite you to participate in interviews, tests, and surveys.
    To stay in the loop and never miss an opportunity to share your thoughts, please subscribe to our UX research program. If you were previously part of the Plesk UX research program, please re-subscribe to continue receiving our invitations.
  • The Horde webmail has been deprecated. Its complete removal is scheduled for April 2025. For details and recommended actions, see the Feature and Deprecation Plan.

Resolved Additional Plesk extensions fails (complete error file enclosed)

Chris Harrington

New Pleskian
Having a continual issue trying to install Plesk extensions. I've tried a server reboot and still having issues. Any ideas on what to do to correct it?

I am on Plesk Onyx 17.8.11 and I always get this error message on screen:

Installation started in background
Determining the packages that need to be installed.
Installing packages
Installing Let's Encrypt extension...
C:\Program Files (x86)\Parallels\Plesk\\bin\extension.exe --upgrade-url https://ext.plesk.com/packages/f6847e61-33a7-4104-8dc9-d26a0183a8dd-letsencrypt/download?2.8.2-529 failed with error 1(0x00000001). Output:
STDERR:Error in cURL request: error setting certificate verify locations:
CAfile: C:\Program Files (x86)\Parallels\Plesk\admin\conf\cacert.pem
CApath: none


Error: The installation of the package 'ext-letsencrypt' failed with code 1. (install: Installing Let's Encrypt extension...)
Not all packages were installed.
Please contact product technical support.
The full error log contains:

[2019-08-02 12:19:09.807067] Installation started in background
[2019-08-02 12:19:09.808066] Determining the packages that need to be installed.
[2019-08-02 12:19:09.808066] Getting packages to installation list:
[2019-08-02 12:19:09.808066] Following packages will be installed: ext-letsencrypt-2.8.2-529.noarch
[2019-08-02 12:19:09.808066] ----------------
[2019-08-02 12:19:09.810175] Warning: unresolved requires 'dotnet46' from mssql2016_configurator-1.0.noarch
[2019-08-02 12:19:09.810175] Warning: unresolved requires 'dotnet46' from mssql2017_configurator-1.0.noarch
[2019-08-02 12:19:09.812075] Warning: unresolved requires 'dotnet46' from sql2016_express-1.0.x86_64
[2019-08-02 12:19:09.812075] Warning: unresolved requires 'dotnet46' from sql2017_express-1.0.x86_64
[2019-08-02 12:19:09.814091] Add packages with unresolved deps to blacklist
[2019-08-02 12:19:09.815387] PkgManager: start resolving packages
[2019-08-02 12:19:09.815387] findNecessaryPackages(): start pass 0
[2019-08-02 12:19:09.815387] Find directly required packages for ext-letsencrypt-2.8.2-529.noarch
[2019-08-02 12:19:09.816085] === Package resolving sucessfuly ends ===
[2019-08-02 12:19:09.816085] (e) ext-letsencrypt-2.8.2
[2019-08-02 12:19:09.817087] (s) plesk-17.8.18165
[2019-08-02 12:19:09.817087] Check package set before installation
[2019-08-02 12:19:09.817117] The following packages from not selected components will be installed because they are required by other components' packages you selected for installation:
[2019-08-02 12:19:09.817117] Installing packages
[2019-08-02 12:19:09.817117] Create tiny repository only with resolved list and system packages
[2019-08-02 12:19:09.817117] Regenerate packages provides cache.
[2019-08-02 12:19:09.827076] Warning: unresolved requires 'vcredist90' from panel-17.8.11.noarch
[2019-08-02 12:19:09.827076] Warning: unresolved requires 'vcredist100' from panel-17.8.11.noarch
[2019-08-02 12:19:09.827076] Warning: unresolved requires 'vcredist110' from panel-17.8.11.noarch
[2019-08-02 12:19:09.827076] Warning: unresolved requires 'vcredist140' from panel-17.8.11.noarch
[2019-08-02 12:19:09.827076] Warning: unresolved requires 'vcredist140' from plesk-repair-module-17.8.11.noarch
[2019-08-02 12:19:09.828079] Warning: unresolved requires 'vcredist90' from plesk-backend-17.8.20703.noarch
[2019-08-02 12:19:09.828079] Warning: unresolved requires 'vcredist110' from plesk-backend-17.8.20703.noarch
[2019-08-02 12:19:09.828079] Warning: unresolved requires 'vcredist140' from plesk-backend-17.8.20703.noarch
[2019-08-02 12:19:09.829080] Warning: unresolved requires 'iis-web-components' from plesk-service-node-17.8.8480.noarch
[2019-08-02 12:19:09.829080] Warning: unresolved requires 'iis-web-components' from plesk-site-17.8.10286.noarch
[2019-08-02 12:19:09.829080] Warning: unresolved requires 'iis-web-components' from plesk-engine-17.8.17007.noarch
[2019-08-02 12:19:09.830085] Warning: unresolved requires 'vcredist90' from plesk-python-2.7.11003.noarch
[2019-08-02 12:19:09.830085] Warning: unresolved requires 'vcredist110' from plesk-perl-5.20.103.noarch
[2019-08-02 12:19:09.830085] Warning: unresolved requires 'vcredist90' from php53-5.3.2901.noarch
[2019-08-02 12:19:09.830085] Warning: unresolved requires 'vcredist100' from php53-5.3.2901.noarch
[2019-08-02 12:19:09.831079] Warning: unresolved requires 'vcredist90' from php54-5.4.4502.noarch
[2019-08-02 12:19:09.831079] Warning: unresolved requires 'vcredist100' from php54-5.4.4502.noarch
[2019-08-02 12:19:09.831079] Warning: unresolved requires 'vcredist110' from php55-5.5.3820.noarch
[2019-08-02 12:19:09.832086] Warning: unresolved requires 'vcredist140' from plesk-urlprotection-17.8.9.noarch
[2019-08-02 12:19:09.833088] Warning: unresolved requires 'vcredist100' from sqlncli-11.3.6538.0.x86_64
[2019-08-02 12:19:09.833088] Warning: unresolved requires 'vcredist100' from msodbcsql11-12.2.5543.11.x86_64
[2019-08-02 12:19:09.836088] Find directly required packages for ext-letsencrypt-2.8.2-529.noarch
[2019-08-02 12:19:09.836088] (update package names cache)
[2019-08-02 12:19:09.836088] (regen obsoletes cache)
[2019-08-02 12:19:09.837078] (regen conflicts cache)
[2019-08-02 12:19:09.837078] Installing Let's Encrypt extension...
[2019-08-02 12:19:11.366253] Package action: Execute, package: ext-letsencrypt, exec time: 2 sec. desc: "program='[PLESK_INSTALLDIR]\bin\extension.exe'," "command-line='--upgrade-url" "https://ext.plesk.com/packages/f6847e61-33a7-4104-8dc9-d26a0183a8dd-letsencrypt/download?2.8.2-529'," "working-dir=''," "context=''," "arch=''", output='
STDERR:Error in cURL request: error setting certificate verify locations:
CAfile: C:\Program Files (x86)\Parallels\Plesk\admin\conf\cacert.pem
CApath: none


'
[2019-08-02 12:19:11.366253] C:\Program Files (x86)\Parallels\Plesk\\bin\extension.exe --upgrade-url https://ext.plesk.com/packages/f6847e61-33a7-4104-8dc9-d26a0183a8dd-letsencrypt/download?2.8.2-529 failed with error 1(0x00000001). Output:
STDERR:Error in cURL request: error setting certificate verify locations:
CAfile: C:\Program Files (x86)\Parallels\Plesk\admin\conf\cacert.pem
CApath: none



Action '<execute program="[PLESK_INSTALLDIR]\bin\extension.exe" command-line="--upgrade-url [EXT_DOWNLOAD_URL]" critical="true" />' failed with error 1(0x00000001)
Error: The installation of the package 'ext-letsencrypt' failed with code 1. (install: Installing Let's Encrypt extension...)
Not all packages were installed.
Please contact product technical support.

 
Back
Top